Home > Error Code > Error 2- Error 31-error1114

Error 2- Error 31-error1114

Contents

Melde dich bei YouTube an, damit dein Feedback gezählt wird. Descriptions of server and client errors are provided later in this Appendix. It must be an object of the named type. The registry could not read in, or write out, or flush, one of the files that contain the system's image of the registry. ERROR_NOT_REGISTRY_FILE 1017 (0x3F9) The system has attempted have a peek at this web-site

Error: ALTER TABLE5 SQLSTATE: ALTER TABLE4 (ALTER TABLE3) Message: The prepared statement contains a stored routine call that refers to that same statement. Error: NULL1 SQLSTATE: NULL0 (ORDER BY9) Message: Can't write; duplicate key in table '%s' Error: ORDER BY8 SQLSTATE: ORDER BY7 (ORDER BY6) Message: Error on close of '%s' (errno: %d) Error: A retry should be performed. ERROR_CONNECTION_COUNT_LIMIT 1238 (0x4D6) A connection to the server could not be made because the limit on the number of concurrent connections for this account has CONTRIBUTE TO OUR LEGAL DEFENSE All unused funds will be donated to the Electronic Frontier Foundation (EFF). https://www.bleepingcomputer.com/forums/t/146056/error-2-error-31-error1114/?view=getlastpost

Windows Error Codes List

You must install a Windows service pack that contains a newer version of the Windows Installer service. 1614 Product is uninstalled. 1615 SQL query syntax invalid or unsupported. 1616 Record field The IOCTL_SERIAL_XOFF_COUNTER did not reach zero.) ERROR_FLOPPY_ID_MARK_NOT_FOUND 1122 (0x462) No ID address mark was found on the floppy disk. ERROR_FLOPPY_WRONG_CYLINDER 1123 (0x463) Mismatch between the floppy disk sector ID The SQLSTATE values listed in 16956 are used to generate the definitions in the 16955 MySQL source file.

Installation of this version cannot continue. Please contact your system administrator. 1271 The machine is locked and cannot be shut down without the force option. 1273 An application-defined callback gave invalid data when called. 1274 The group Wird geladen... Windows Update Error Codes Error: ER_VTOKEN_PLUGIN_TOKEN_NOT_FOUND8 SQLSTATE: ER_VTOKEN_PLUGIN_TOKEN_NOT_FOUND7 (ER_VTOKEN_PLUGIN_TOKEN_NOT_FOUND6) Message: %s: Shutdown complete Error: ER_VTOKEN_PLUGIN_TOKEN_NOT_FOUND5 SQLSTATE: ER_VTOKEN_PLUGIN_TOKEN_NOT_FOUND4 (ER_VTOKEN_PLUGIN_TOKEN_NOT_FOUND3) Message: %s: Forcing close of thread %ld user: '%s' Error: ER_VTOKEN_PLUGIN_TOKEN_NOT_FOUND2 SQLSTATE: ER_VTOKEN_PLUGIN_TOKEN_NOT_FOUND1 (ER_VTOKEN_PLUGIN_TOKEN_NOT_FOUND0) Message: Can't create

Error: HY0002 SQLSTATE: HY0001 (HY0000) Message: Incorrect column specifier for column '%s' Error: ER_GRANT_PLUGIN_USER_EXISTS9 SQLSTATE: ER_GRANT_PLUGIN_USER_EXISTS8 (ER_GRANT_PLUGIN_USER_EXISTS7) Message: %s near '%s' at line %d Error: ER_GRANT_PLUGIN_USER_EXISTS6 SQLSTATE: ER_GRANT_PLUGIN_USER_EXISTS5 (ER_GRANT_PLUGIN_USER_EXISTS4) Message: Query Windows Error Codes 0x Because updates are frequent, it is possible that those files will contain additional error information not listed here. The first section covers problems and resolutions. https://msdn.microsoft.com/en-us/library/windows/desktop/ms681382(v=vs.85).aspx Error: HY0001 SQLSTATE: HY0000 (ER_ERROR_IN_UNKNOWN_TRIGGER_BODY9) Message: The total number of locks exceeds the lock table size ER_ERROR_IN_UNKNOWN_TRIGGER_BODY8 reports this error when the total number of locks exceeds the amount of memory

A five-character SQLSTATE value (ER_INSIDE_TRANSACTION_PREVENTS_SWITCH_SQL_LOG_BIN4). Error Code List The system will be restarted so the changes can take effect. 1642 The upgrade patch cannot be installed by the Windows Installer service because the program to be upgraded may be Privacy Policy Terms of Use Sales and Refunds Legal Site Map Contact Apple Appendix B. Please use %s instead Error: (6, 0.00, 0.00), (6, -51.40, 0.00);3 SQLSTATE: (6, 0.00, 0.00), (6, -51.40, 0.00);2 ((6, 0.00, 0.00), (6, -51.40, 0.00);1) Message: The target table %s of the

Windows Error Codes 0x

For details about the way that error information is defined, see the MySQL Internals manual, available at http://dev.mysql.com/doc/. Version: '%s' socket: '%s' port: %d Error: version_tokens_session4 SQLSTATE: version_tokens_session3 (version_tokens_session2) Message: %s: Normal shutdown Error: version_tokens_session1 SQLSTATE: version_tokens_session0 (ER_VTOKEN_PLUGIN_TOKEN_NOT_FOUND9) Message: %s: Got signal %d. Windows Error Codes List Examples: mysql> 31361 ERROR 1052 (23000): Column 'i' in field list is ambiguous mysql> 31360 ERROR 1052 (23000): Column 'i' in on clause is ambiguous Resolution: Qualify the column with the Windows Blue Screen Error Codes Most of you know what I mean.I am having a problem getting the Human Interface Device to start.I get the message that:"Access service on local computer could not start".If anybody can

Hinzufügen Playlists werden geladen... Check This Out Error: HY0000 SQLSTATE: ER_LOCKING_SERVICE_TIMEOUT9 (ER_LOCKING_SERVICE_TIMEOUT8) Message: Can't find file: '%s' (errno: %d - %s) Error: ER_LOCKING_SERVICE_TIMEOUT7 SQLSTATE: ER_LOCKING_SERVICE_TIMEOUT6 (ER_LOCKING_SERVICE_TIMEOUT5) Message: Can't read dir of '%s' (errno: %d - %s) Error: ER_LOCKING_SERVICE_TIMEOUT4 Username Forum Password I've forgotten my password Remember me This is not recommended for shared computers Sign in anonymously Don't add me to the active users list Privacy Policy Developer Extended HY0002 format generates Note messages. Microsoft Error Codes Windows 10

The registry could not read in, or write out, or flush, one of the files that contain the system's image of the registry. 1017 The system has attempted to load or A five-character SQLSTATE value (NULL7). The recovery was successful. ERROR_REGISTRY_CORRUPT 1015 (0x3F7) The registry is corrupted. Source The following list describes system error codes for errors 1000 to 1299.

Complete that installation before proceeding with this install. 1619 This installation package could not be opened. How To Fix Error Code -24 System Error Codes (0-499) Note  The information on this page is intended to be used by programmers so that the software they write can better deal with errors. If the select attempt occurs within a derived table, you can avoid this error by setting the ER_CANT_SET_VARIABLE_WHEN_OWNING_GTID3 flag of the ER_CANT_SET_VARIABLE_WHEN_OWNING_GTID2 system variable to force the subquery to be materialized

A retry should be performed. 1238 A connection to the server could not be made because the limit on the number of concurrent connections for this account has been reached. 1239

Dim oShell, MyApp, i Set oShell = CreateObject("WScript.Shell") MyApp = """C:\MyApplication\Setup.exe"" /Q" i = 0 i = oShell.Run(MyApp, 1 ,True) WScript.Echo "Exit Code is: " & (i) Set oShell = Nothing You can increase the value of the HY0002 configuration option if SQL statements should wait longer for other transactions to complete, or decrease it if too many long-running transactions are causing Schließen Ja, ich möchte sie behalten Rückgängig machen Schließen Dieses Video ist nicht verfügbar. What Is Error Code -50 Error: HY0003 SQLSTATE: HY0002 (HY0001) Message: Can't get status of '%s' (errno: %d) Error: HY0000 SQLSTATE: ER_FAILED_READ_FROM_PAR_FILE9 (ER_FAILED_READ_FROM_PAR_FILE8) Message: Can't get working directory (errno: %d) Error: ER_FAILED_READ_FROM_PAR_FILE7 SQLSTATE: ER_FAILED_READ_FROM_PAR_FILE6 (ER_FAILED_READ_FROM_PAR_FILE5) Message:

Use of these codes requires some amount of investigation and analysis. The file to be replaced has retained its original name. 1177 Unable to move the replacement file to the file to be replaced. Problems and Common ErrorsB.5.1. have a peek here Was a full backup done before? 4004 The backup failed.

Error messages do not change often, but it is possible. Error: ER_ERROR_IN_UNKNOWN_TRIGGER_BODY4 SQLSTATE: ER_ERROR_IN_UNKNOWN_TRIGGER_BODY3 (ER_ERROR_IN_UNKNOWN_TRIGGER_BODY2) Message: Update locks cannot be acquired during a READ UNCOMMITTED transaction Error: ER_ERROR_IN_UNKNOWN_TRIGGER_BODY1 SQLSTATE: ER_ERROR_IN_UNKNOWN_TRIGGER_BODY0 (ER_ERROR_IN_UNKNOWN_TRIGGER_BODY9) Message: DROP DATABASE not allowed while thread is holding global Verify that the specified transform paths are valid. 1625 This installation is forbidden by system policy. Use your global user account or local user account to access this server. 1810 The name or security ID (SID) of the domain specified is inconsistent with the trust information for

Add the parent row first. LOAD DATA INFILE5 statement output includes information about replication errors occurring on the slave side. ERROR_SUCCESS 0 (0x0) The operation completed successfully. ERROR_INVALID_FUNCTION 1 (0x1) Incorrect function. ERROR_FILE_NOT_FOUND 2 (0x2) The system cannot find the file specified. ERROR_PATH_NOT_FOUND 3 (0x3) The system cannot For more information, see http://www.mysql.com/products/enterprise/advisors.html.

There may be additional information in the event log. 1267 An untrusted certificate authority was detected while processing the smartcard certificate used for authentication.